Reaction Details
TargetPhosphatidylinositol 4,5-bisphosphate 3-kinase catalytic subunit alpha isoform
LigandBDBM50436453
Substrate/Competitorn/a
Meas. Tech.ChEMBL_967910 (CHEMBL2400726)
IC50 340±n/a nM
Citation Furet, PGuagnano, VFairhurst, RAImbach-Weese, PBruce, IKnapp, MFritsch, CBlasco, FBlanz, JAichholz, RHamon, JFabbro, DCaravatti, G Discovery of NVP-BYL719 a potent and selective phosphatidylinositol-3 kinase alpha inhibitor selected for clinical evaluation. Bioorg Med Chem Lett23:3741-8 (2013) 
 
Phosphatidylinositol 4,5-bisphosphate 3-kinase catalytic subunit alpha isoform
Name:Phosphatidylinositol 4,5-bisphosphate 3-kinase catalytic subunit alpha isoform
Type:Enzyme Subunit
Mol. Mass.:124294.87
Organism:Homo sapiens (Human)
Description:P42336
Residue:1068
BDBM50436453
NameBDBM50436453
Synonyms:CHEMBL2397197
TypeSmall organic molecule
Emp. Form.C18H19ClF3N5O2S
Mol. Mass.461.889
SMILESCC(C)(c1cc(ccn1)-c1sc(NC(=O)N2CCC[C@H]2C(N)=O)nc1Cl)C(F)(F)F