Reaction Details
TargetPhosphatidylinositol 4,5-bisphosphate 3-kinase catalytic subunit alpha isoform
LigandBDBM50436459
Substrate/Competitorn/a
Meas. Tech.ChEMBL_967910 (CHEMBL2400726)
IC50 74±n/a nM
Citation Furet, PGuagnano, VFairhurst, RAImbach-Weese, PBruce, IKnapp, MFritsch, CBlasco, FBlanz, JAichholz, RHamon, JFabbro, DCaravatti, G Discovery of NVP-BYL719 a potent and selective phosphatidylinositol-3 kinase alpha inhibitor selected for clinical evaluation. Bioorg Med Chem Lett23:3741-8 (2013) 
 
Phosphatidylinositol 4,5-bisphosphate 3-kinase catalytic subunit alpha isoform
Name:Phosphatidylinositol 4,5-bisphosphate 3-kinase catalytic subunit alpha isoform
Type:Enzyme Subunit
Mol. Mass.:124294.87
Organism:Homo sapiens (Human)
Description:P42336
Residue:1068
BDBM50436459
NameBDBM50436459
Synonyms:CHEMBL2396661
TypeSmall organic molecule
Emp. Form.C19H22F3N5O2S
Mol. Mass.441.47
SMILESCc1nc(NC(=O)N2CCC[C@H]2C(N)=O)sc1-c1ccnc(c1)C(C)(C)C(F)(F)F