Reaction Details
TargetPhosphatidylinositol 4,5-bisphosphate 3-kinase catalytic subunit beta isoform
LigandBDBM50436454
Substrate/Competitorn/a
Meas. Tech.ChEMBL_967914 (CHEMBL2400730)
IC50 3900±n/a nM
Citation Furet, PGuagnano, VFairhurst, RAImbach-Weese, PBruce, IKnapp, MFritsch, CBlasco, FBlanz, JAichholz, RHamon, JFabbro, DCaravatti, G Discovery of NVP-BYL719 a potent and selective phosphatidylinositol-3 kinase alpha inhibitor selected for clinical evaluation. Bioorg Med Chem Lett23:3741-8 (2013) 
 
Phosphatidylinositol 4,5-bisphosphate 3-kinase catalytic subunit beta isoform
Name:Phosphatidylinositol 4,5-bisphosphate 3-kinase catalytic subunit beta isoform
Type:Enzyme Subunit
Mol. Mass.:122769.00
Organism:Homo sapiens (Human)
Description:P42338
Residue:1070
BDBM50436454
NameBDBM50436454
Synonyms:CHEMBL2397196
TypeSmall organic molecule
Emp. Form.C18H20F3N5O2S
Mol. Mass.427.444
SMILESCC(C)(c1cc(ccn1)-c1cnc(NC(=O)N2CCC[C@H]2C(N)=O)s1)C(F)(F)F