Reaction Details
TargetPhosphatidylinositol 4,5-bisphosphate 3-kinase catalytic subunit gamma isoform
LigandBDBM50436458
Substrate/Competitorn/a
Meas. Tech.ChEMBL_967913 (CHEMBL2400729)
IC50 1100±n/a nM
Citation Furet, PGuagnano, VFairhurst, RAImbach-Weese, PBruce, IKnapp, MFritsch, CBlasco, FBlanz, JAichholz, RHamon, JFabbro, DCaravatti, G Discovery of NVP-BYL719 a potent and selective phosphatidylinositol-3 kinase alpha inhibitor selected for clinical evaluation. Bioorg Med Chem Lett23:3741-8 (2013) 
 
Phosphatidylinositol 4,5-bisphosphate 3-kinase catalytic subunit gamma isoform
Name:Phosphatidylinositol 4,5-bisphosphate 3-kinase catalytic subunit gamma isoform
Type:Enzyme Subunit
Mol. Mass.:126470.30
Organism:Homo sapiens (Human)
Description:P48736
Residue:1102
BDBM50436458
NameBDBM50436458
Synonyms:CHEMBL2397192
TypeSmall organic molecule
Emp. Form.C19H20N6O2S
Mol. Mass.396.466
SMILESCc1nc(NC(=O)N2CCC[C@H]2C(N)=O)sc1-c1ccnc(c1)C1(CC1)C#N