Reaction Details
TargetPhosphatidylinositol 4,5-bisphosphate 3-kinase catalytic subunit delta isoform
LigandBDBM50436462
Substrate/Competitorn/a
Meas. Tech.ChEMBL_967915 (CHEMBL2400731)
IC50 590±n/a nM
Citation Furet, PGuagnano, VFairhurst, RAImbach-Weese, PBruce, IKnapp, MFritsch, CBlasco, FBlanz, JAichholz, RHamon, JFabbro, DCaravatti, G Discovery of NVP-BYL719 a potent and selective phosphatidylinositol-3 kinase alpha inhibitor selected for clinical evaluation. Bioorg Med Chem Lett23:3741-8 (2013) 
 
Phosphatidylinositol 4,5-bisphosphate 3-kinase catalytic subunit delta isoform
Name:Phosphatidylinositol 4,5-bisphosphate 3-kinase catalytic subunit delta isoform
Type:Enzyme Subunit
Mol. Mass.:119489.41
Organism:Homo sapiens (Human)
Description:O00329
Residue:1044
BDBM50436462
NameBDBM50436462
Synonyms:CHEMBL2397189
TypeSmall organic molecule
Emp. Form.C18H24N4OS
Mol. Mass.344.474
SMILESCc1nc(NC(=O)N2CCCC2)sc1-c1ccnc(c1)C(C)(C)C