Reaction Details
TargetSerine-protein kinase ATM
LigandBDBM50436459
Substrate/Competitorn/a
Meas. Tech.ChEMBL_967888 (CHEMBL2400704)
IC50>10000±n/a nM
Citation Furet, PGuagnano, VFairhurst, RAImbach-Weese, PBruce, IKnapp, MFritsch, CBlasco, FBlanz, JAichholz, RHamon, JFabbro, DCaravatti, G Discovery of NVP-BYL719 a potent and selective phosphatidylinositol-3 kinase alpha inhibitor selected for clinical evaluation. Bioorg Med Chem Lett23:3741-8 (2013) 
 
Serine-protein kinase ATM
Name:Serine-protein kinase ATM
Type:Protein
Mol. Mass.:350696.72
Organism:Homo sapiens (Human)
Description:Q13315
Residue:3056
BDBM50436459
NameBDBM50436459
Synonyms:CHEMBL2396661
TypeSmall organic molecule
Emp. Form.C19H22F3N5O2S
Mol. Mass.441.47
SMILESCc1nc(NC(=O)N2CCC[C@H]2C(N)=O)sc1-c1ccnc(c1)C(C)(C)C(F)(F)F