Reaction Details
TargetPhosphatidylinositol 4,5-bisphosphate 3-kinase catalytic subunit beta isoform
LigandBDBM50436450
Substrate/Competitorn/a
Meas. Tech.ChEMBL_967909 (CHEMBL2400725)
IC50 8000±n/a nM
Citation Furet, PGuagnano, VFairhurst, RAImbach-Weese, PBruce, IKnapp, MFritsch, CBlasco, FBlanz, JAichholz, RHamon, JFabbro, DCaravatti, G Discovery of NVP-BYL719 a potent and selective phosphatidylinositol-3 kinase alpha inhibitor selected for clinical evaluation. Bioorg Med Chem Lett23:3741-8 (2013) 
 
Phosphatidylinositol 4,5-bisphosphate 3-kinase catalytic subunit beta isoform
Name:Phosphatidylinositol 4,5-bisphosphate 3-kinase catalytic subunit beta isoform
Type:Enzyme Subunit
Mol. Mass.:122769.00
Organism:Homo sapiens (Human)
Description:P42338
Residue:1070
BDBM50436450
NameBDBM50436450
Synonyms:CHEMBL2397187
TypeSmall organic molecule
Emp. Form.C19H25N5O2S
Mol. Mass.387.499
SMILESCc1nc(NC(=O)N2CCC[C@H]2C(N)=O)sc1-c1ccnc(c1)C(C)(C)C