Reaction Details
TargetTyrosine-protein kinase ABL1
LigandBDBM50436577
Substrate/Competitorn/a
Meas. Tech.ChEMBL_967169 (CHEMBL2399913)
Ki 2530±n/a nM
Citation Radi, MTintori, CMusumeci, FBrullo, CZamperini, CDreassi, EFallacara, ALVignaroli, GCrespan, EZanoli, SLaurenzana, IFilippi, IMaga, GSchenone, SAngelucci, ABotta, M Design, synthesis, and biological evaluation of pyrazolo[3,4-d]pyrimidines active in vivo on the Bcr-Abl T315I mutant. J Med Chem56:5382-94 (2014) 
 
Tyrosine-protein kinase ABL1
Name:Tyrosine-protein kinase ABL1
Type:Enzyme
Mol. Mass.:122897.30
Organism:Homo sapiens (Human)
Description:P00519
Residue:1130
BDBM50436577
NameBDBM50436577
Synonyms:CHEMBL2397809
TypeSmall organic molecule
Emp. Form.C20H16BrClFN5
Mol. Mass.460.73
SMILESFc1ccc(CNc2ncnc3n(CC(Cl)c4ccc(Br)cc4)ncc23)cc1