Reaction Details
TargetE3 ubiquitin-protein ligase Mdm2
LigandBDBM50436681
Substrate/Competitorn/a
Meas. Tech.ChEMBL_967970 (CHEMBL2401074)
Ki 0.620000±n/a nM
Citation Zhao, YYu, SSun, WLiu, LLu, JMcEachern, DShargary, SBernard, DLi, XZhao, TZou, PSun, DWang, S A potent small-molecule inhibitor of the MDM2-p53 interaction (MI-888) achieved complete and durable tumor regression in mice. J Med Chem56:5553-61 (2014) 
 
E3 ubiquitin-protein ligase Mdm2
Name:E3 ubiquitin-protein ligase Mdm2
Type:Oncoprotein
Mol. Mass.:55196.54
Organism:Homo sapiens (Human)
Description:Q00987
Residue:491
BDBM50436681
NameBDBM50436681
Synonyms:CHEMBL2398479
TypeSmall organic molecule
Emp. Form.C28H33Cl2FN4O4S
Mol. Mass.611.555
SMILESCC(C)(C)C[C@@H]1N[C@H]([C@H](c2cccc(Cl)c2F)[C@]11C(=O)Nc2cc(Cl)ccc12)C(=O)N[C@H]1C[C@@H](C1)NS(C)(=O)=O