Reaction Details
TargetE3 ubiquitin-protein ligase Mdm2
LigandBDBM50436689
Substrate/Competitorn/a
Meas. Tech.ChEMBL_967970 (CHEMBL2401074)
Ki 0.860000±n/a nM
Citation Zhao, YYu, SSun, WLiu, LLu, JMcEachern, DShargary, SBernard, DLi, XZhao, TZou, PSun, DWang, S A potent small-molecule inhibitor of the MDM2-p53 interaction (MI-888) achieved complete and durable tumor regression in mice. J Med Chem56:5553-61 (2014) 
 
E3 ubiquitin-protein ligase Mdm2
Name:E3 ubiquitin-protein ligase Mdm2
Type:Oncoprotein
Mol. Mass.:55196.54
Organism:Homo sapiens (Human)
Description:Q00987
Residue:491
BDBM50436689
NameBDBM50436689
Synonyms:CHEMBL2398472
TypeSmall organic molecule
Emp. Form.C27H32Cl2FN3O4
Mol. Mass.552.465
SMILESCC(C)(C)C[C@@H]1N[C@H]([C@H](c2cccc(Cl)c2F)[C@]11C(=O)Nc2cc(Cl)ccc12)C(=O)NCC[C@H](O)CO