Reaction Details
TargetP2Y purinoceptor 12
LigandBDBM50436963
Substrate/Competitorn/a
Meas. Tech.ChEMBL_969257 (CHEMBL2404822)
IC50 9.5±n/a nM
Citation Bach, PBoström, JBrickmann, Kvan Giezen, JJGroneberg, RDHarvey, DMO'Sullivan, MZetterberg, F Synthesis, structure-property relationships and pharmacokinetic evaluation of ethyl 6-aminonicotinate sulfonylureas as antagonists of the P2Y12 receptor. Eur J Med Chem65:360-75 (2013) 
 
P2Y purinoceptor 12
Name:P2Y purinoceptor 12
Type:Enzyme
Mol. Mass.:39458.48
Organism:Homo sapiens (Human)
Description:Q9H244
Residue:342
BDBM50436963
NameBDBM50436963
Synonyms:CHEMBL2402255
TypeSmall organic molecule
Emp. Form.C18H18ClN5O5S2
Mol. Mass.483.949
SMILESCCOC(=O)c1cc(C#N)c(nc1C)N1CC(C1)NC(=O)NS(=O)(=O)c1ccc(Cl)s1