Reaction Details
TargetSerine/threonine-protein kinase PAK 1
LigandBDBM50437027
Substrate/Competitorn/a
Meas. Tech.ChEMBL_971747 (CHEMBL2404583)
EC50 3590±n/a nM
Citation Xu, YFoulks, JMClifford, ABrenning, BLai, SLuo, BParnell, KMMerx, SMcCullar, MVKanner, SBHo, KK Synthesis and structure-activity relationship of 2-arylamino-4-aryl-pyrimidines as potent PAK1 inhibitors. Bioorg Med Chem Lett23:4072-5 (2013) 
 
Serine/threonine-protein kinase PAK 1
Name:Serine/threonine-protein kinase PAK 1
Type:n/a
Mol. Mass.:60640.15
Organism:Homo sapiens (Human)
Description:Q13153
Residue:545
BDBM50437027
NameBDBM50437027
Synonyms:CHEMBL2403080
TypeSmall organic molecule
Emp. Form.C25H27BrN6O
Mol. Mass.507.425
SMILESCOc1cc(Nc2ncc(Br)c(n2)-c2cccc(CC#N)c2)ccc1N1CCN(C)[C@H](C)C1