Reaction Details
TargetSerine/threonine-protein kinase PAK 1
LigandBDBM50437035
Substrate/Competitorn/a
Meas. Tech.ChEMBL_971747 (CHEMBL2404583)
EC50 10900±n/a nM
Citation Xu, YFoulks, JMClifford, ABrenning, BLai, SLuo, BParnell, KMMerx, SMcCullar, MVKanner, SBHo, KK Synthesis and structure-activity relationship of 2-arylamino-4-aryl-pyrimidines as potent PAK1 inhibitors. Bioorg Med Chem Lett23:4072-5 (2013) 
 
Serine/threonine-protein kinase PAK 1
Name:Serine/threonine-protein kinase PAK 1
Type:n/a
Mol. Mass.:60640.15
Organism:Homo sapiens (Human)
Description:Q13153
Residue:545
BDBM50437035
NameBDBM50437035
Synonyms:CHEMBL2403070
TypeSmall organic molecule
Emp. Form.C26H27ClN6O2
Mol. Mass.490.985
SMILESCCOC(=O)c1cc(Nc2ncc(Cl)c(n2)-c2cccc(CC#N)c2)ccc1N1CCN(C)CC1