Reaction Details
TargetSerine/threonine-protein kinase PAK 1
LigandBDBM50437023
Substrate/Competitorn/a
Meas. Tech.ChEMBL_971747 (CHEMBL2404583)
EC50 12400±n/a nM
Citation Xu, YFoulks, JMClifford, ABrenning, BLai, SLuo, BParnell, KMMerx, SMcCullar, MVKanner, SBHo, KK Synthesis and structure-activity relationship of 2-arylamino-4-aryl-pyrimidines as potent PAK1 inhibitors. Bioorg Med Chem Lett23:4072-5 (2013) 
 
Serine/threonine-protein kinase PAK 1
Name:Serine/threonine-protein kinase PAK 1
Type:n/a
Mol. Mass.:60640.15
Organism:Homo sapiens (Human)
Description:Q13153
Residue:545
BDBM50437023
NameBDBM50437023
Synonyms:CHEMBL2403059
TypeSmall organic molecule
Emp. Form.C24H25ClN6O2
Mol. Mass.464.947
SMILESCOc1cc(cc(c1)-c1nc(Nc2ccc(N3CCN(C)CC3)c(OC)c2)ncc1Cl)C#N