Reaction Details
TargetProto-oncogene tyrosine-protein kinase Src
LigandBDBM4814
Substrate/Competitorn/a
Meas. Tech.ChEMBL_970148 (CHEMBL2406233)
IC50 555±n/a nM
Citation Richters, AKetzer, JGetlik, MGrütter, CSchneider, RHeuckmann, JMHeynck, SSos, MLGupta, AUnger, ASchultz-Fademrecht, CThomas, RKBauer, SRauh, D Targeting gain of function and resistance mutations in Abl and KIT by hybrid compound design. J Med Chem56:5757-72 (2014) 
 
Proto-oncogene tyrosine-protein kinase Src
Name:Proto-oncogene tyrosine-protein kinase Src
Type:Tyr protein kinase
Mol. Mass.:60015.36
Organism:Gallus gallus (Chicken)
Description:P00523
Residue:533
BDBM4814
NameBDBM4814
Synonyms:CHEMBL535 N-[2-(diethylamino)ethyl]-5-{[(3Z)-5-fluoro-2-oxo-2,3-dihydro-1H-indol-3-ylidene]methyl}-2,4-dimethyl-1H-pyrrole-3-carboxamide SUNITINIB US10464902, Sunitinib US9163010, Sunitinib | US9914707, SU11248
TypeSmall organic molecule
Emp. Form.C22H27FN4O2
Mol. Mass.398.4738
SMILESCCN(CC)CCNC(=O)c1c(C)[nH]c(\C=C2/C(=O)Nc3ccc(F)cc23)c1C