Reaction Details
TargetProto-oncogene tyrosine-protein kinase Src
LigandBDBM92348
Substrate/Competitorn/a
Meas. Tech.ChEMBL_970148 (CHEMBL2406233)
IC50 1.1±n/a nM
Citation Richters, AKetzer, JGetlik, MGrütter, CSchneider, RHeuckmann, JMHeynck, SSos, MLGupta, AUnger, ASchultz-Fademrecht, CThomas, RKBauer, SRauh, D Targeting gain of function and resistance mutations in Abl and KIT by hybrid compound design. J Med Chem56:5757-72 (2014) 
 
Proto-oncogene tyrosine-protein kinase Src
Name:Proto-oncogene tyrosine-protein kinase Src
Type:Tyr protein kinase
Mol. Mass.:60015.36
Organism:Gallus gallus (Chicken)
Description:P00523
Residue:533
BDBM92348
NameBDBM92348
Synonyms:1,4-Hybrid, 6
TypeSmall organic molecule
Emp. Form.C34H40N10O2
Mol. Mass.620.7472
SMILESCN(C)CCCC(=O)Nc1ccc2ncnc(Nc3ccc(NC(=O)Nc4cc(nn4-c4cccc(N)c4)C(C)(C)C)cc3)c2c1