Reaction Details
Target11-beta-hydroxysteroid dehydrogenase 1
LigandBDBM50315878
Substrate/Competitorn/a
Meas. Tech.ChEMBL_969408 (CHEMBL2405598)
IC50 1147±n/a nM
Citation Lin, HHu, GXGuo, JGe, YLiang, GLian, QQChu, YYuan, XHuang, PGe, RS Mono-carbonyl curcumin analogues as 11ß-hydroxysteroid dehydrogenase 1 inhibitors. Bioorg Med Chem Lett23:4362-6 (2013) 
 
11-beta-hydroxysteroid dehydrogenase 1
Name:11-beta-hydroxysteroid dehydrogenase 1
Type:Enzyme
Mol. Mass.:31889.48
Organism:Rattus norvegicus (rat)
Description:P16232
Residue:288
BDBM50315878
NameBDBM50315878
Synonyms:2,5-bis(3-bromobenzylidene)cyclopentanone | CHEMBL1093862
TypeSmall organic molecule
Emp. Form.C19H14Br2O
Mol. Mass.418.122
SMILESBrc1cccc(\C=C2/CC\C(=C/c3cccc(Br)c3)C2=O)c1