Reaction Details
TargetInsulin-like growth factor 1 receptor
LigandBDBM50437358
Substrate/Competitorn/a
Meas. Tech.ChEMBL_972570 (CHEMBL2410392)
IC50 7.1±n/a nM
Citation Jin, MPetronella, BACooke, AKadalbajoo, MSiu, KWKleinberg, AMay, EWGokhale, PCSchulz, RKahler, JBittner, MAForeman, KPachter, JAWild, REpstein, DMulvihill, MJ Discovery of novel insulin-like growth factor-1 receptor inhibitors with unique time-dependent binding kinetics. ACS Med Chem Lett4:627-31 (2013) 
 
Insulin-like growth factor 1 receptor
Name:Insulin-like growth factor 1 receptor
Type:Protein
Mol. Mass.:154776.79
Organism:Homo sapiens (Human)
Description:P08069
Residue:1367
BDBM50437358
NameBDBM50437358
Synonyms:CHEMBL3037908
TypeSmall organic molecule
Emp. Form.C27H25N5O2
Mol. Mass.451.5197
SMILESCOc1cc(nc2cc(ccc12)-c1nc([C@H]2C[C@@](C)(O)C2)n2ccnc(N)c12)-c1ccccc1