Reaction Details
TargetPlatelet-derived growth factor receptor beta
LigandBDBM50437508
Substrate/Competitorn/a
Meas. Tech.ChEMBL_974115 (CHEMBL2410838)
IC50 5.9±n/a nM
Citation Oguro, YCary, DRMiyamoto, NTawada, MIwata, HMiki, HHori, AImamura, S Design, synthesis, and evaluation of novel VEGFR2 kinase inhibitors: discovery of [1,2,4]triazolo[1,5-a]pyridine derivatives with slow dissociation kinetics. Bioorg Med Chem21:4714-29 (2013) 
 
Platelet-derived growth factor receptor beta
Name:Platelet-derived growth factor receptor beta
Type:Enzyme
Mol. Mass.:123922.25
Organism:Homo sapiens (Human)
Description:P09619
Residue:1106
BDBM50437508
NameBDBM50437508
Synonyms:CHEMBL2409779
TypeSmall organic molecule
Emp. Form.C23H22N6O3
Mol. Mass.430.4592
SMILESCc1cc(C(=O)Nc2cccc(Oc3ccc4nc(NC(=O)C5CC5)cn4c3)c2)n(C)n1