Reaction Details
TargetCytochrome P450 2C9
LigandBDBM50437753
Substrate/Competitorn/a
Meas. Tech.ChEMBL_973360 (CHEMBL2410066)
EC50>100000±n/a nM
Citation Kwak, HJPyun, YMKim, JYPagire, HSKim, KYKim, KRRhee, SDJung, WHSong, JSBae, MALee, DHAhn, JH Synthesis and biological evaluation of aminobenzimidazole derivatives with a phenylcyclohexyl acetic acid group as anti-obesity and anti-diabetic agents. Bioorg Med Chem Lett23:4713-8 (2013) 
 
Cytochrome P450 2C9
Name:Cytochrome P450 2C9
Type:Enzyme
Mol. Mass.:55636.33
Organism:Homo sapiens (Human)
Description:P11712
Residue:490
BDBM50437753
NameBDBM50437753
Synonyms:CHEMBL2409564
TypeSmall organic molecule
Emp. Form.C32H27F3N4O4
Mol. Mass.588.5764
SMILESOC(=O)CC1CCC(CC1)c1ccc(cc1)-c1nc2ccc(NC(=O)c3nc(oc3C(F)(F)F)-c3ccccc3)cc2[nH]1