Reaction Details
TargetDiacylglycerol O-acyltransferase 1
LigandBDBM50355142
Substrate/Competitorn/a
Meas. Tech.ChEMBL_973380 (CHEMBL2410086)
IC50 90±n/a nM
Citation Kwak, HJPyun, YMKim, JYPagire, HSKim, KYKim, KRRhee, SDJung, WHSong, JSBae, MALee, DHAhn, JH Synthesis and biological evaluation of aminobenzimidazole derivatives with a phenylcyclohexyl acetic acid group as anti-obesity and anti-diabetic agents. Bioorg Med Chem Lett23:4713-8 (2013) 
 
Diacylglycerol O-acyltransferase 1
Name:Diacylglycerol O-acyltransferase 1
Type:Protein
Mol. Mass.:55297.82
Organism:Homo sapiens (Human)
Description:O75907
Residue:488
BDBM50355142
NameBDBM50355142
Synonyms:CHEMBL1835919
TypeSmall organic molecule
Emp. Form.C21H24N4O4
Mol. Mass.396.4397
SMILESNc1ncnc2OCCN(c3ccc(cc3)[C@H]3CC[C@H](CC(O)=O)CC3)C(=O)c12