Reaction Details
TargetSerine/threonine-protein kinase PLK1
LigandBDBM50065304
Substrate/Competitorn/a
Meas. Tech.ChEMBL_973991 (CHEMBL2410316)
IC50 25000±n/a nM
Citation Laufer, RForrest, BLi, SWLiu, YSampson, PEdwards, LLang, YAwrey, DEMao, GPlotnikova, OLeung, GHodgson, RBeletskaya, IMason, JMLuo, XWei, XYao, YFeher, MBan, FKiarash, RGreen, EMak, TWPan, GPauls, HW The discovery of PLK4 inhibitors: (E)-3-((1H-Indazol-6-yl)methylene)indolin-2-ones as novel antiproliferative agents. J Med Chem56:6069-87 (2013) 
 
Serine/threonine-protein kinase PLK1
Name:Serine/threonine-protein kinase PLK1
Type:Serine/threonine-protein kinase
Mol. Mass.:68277.16
Organism:Homo sapiens (Human)
Description:P53350
Residue:603
BDBM50065304
NameBDBM50065304
Synonyms:3-[1-(4-Hydroxy-phenyl)-meth-(Z)-ylidene]-1,3-dihydro-indol-2-one | CHEMBL313578
TypeSmall organic molecule
Emp. Form.C15H11NO2
Mol. Mass.237.2533
SMILESOc1ccc(\C=C2/C(=O)Nc3ccccc23)cc1