Reaction Details
TargetPapain
LigandBDBM50437948
Substrate/Competitorn/a
Meas. Tech.ChEMBL_972846 (CHEMBL2411623)
Ki 19200±n/a nM
Citation Schiefer, ITTapadar, SLitosh, VSiklos, MScism, RWijewickrama, GTChandrasena, EPSinha, VTavassoli, EBrunsteiner, MFa', MArancio, OPetukhov, PThatcher, GR Design, synthesis, and optimization of novel epoxide incorporating peptidomimetics as selective calpain inhibitors. J Med Chem56:6054-68 (2013) 
 
Papain
Name:Papain
Type:Enzyme
Mol. Mass.:38923.01
Organism:Carica papaya
Description:Papain was purchased from Sigma, Germany.
Residue:345
BDBM50437948
NameBDBM50437948
Synonyms:CHEMBL2408899 | US9403843, 50
TypeSmall organic molecule
Emp. Form.C19H17FN6O5S
Mol. Mass.460.439
SMILESOC(=O)[C@H]1O[C@@H]1C(=O)N[C@@H](Cc1cscn1)C(=O)NCc1cn(nn1)-c1ccc(F)cc1