Reaction Details
TargetPapain
LigandBDBM50437950
Substrate/Competitorn/a
Meas. Tech.ChEMBL_972846 (CHEMBL2411623)
Ki 5310±n/a nM
Citation Schiefer, ITTapadar, SLitosh, VSiklos, MScism, RWijewickrama, GTChandrasena, EPSinha, VTavassoli, EBrunsteiner, MFa', MArancio, OPetukhov, PThatcher, GR Design, synthesis, and optimization of novel epoxide incorporating peptidomimetics as selective calpain inhibitors. J Med Chem56:6054-68 (2013) 
 
Papain
Name:Papain
Type:Enzyme
Mol. Mass.:38923.01
Organism:Carica papaya
Description:Papain was purchased from Sigma, Germany.
Residue:345
BDBM50437950
NameBDBM50437950
Synonyms:CHEMBL2408917
TypeSmall organic molecule
Emp. Form.C19H15FN4O5S2
Mol. Mass.462.475
SMILESOC(=O)[C@H]1O[C@@H]1C(=O)N[C@@H](Cc1cscn1)C(=O)Nc1nc(cs1)-c1ccc(F)cc1