Reaction Details
TargetAngiotensin-converting enzyme
LigandBDBM50367879
Substrate/Competitorn/a
Meas. Tech.ChEMBL_975642 (CHEMBL2416126)
IC50 262±n/a nM
Citation Addla, DJallapally, AKanwal, ASridhar, BBanerjee, SKKantevari, S Design, synthesis and evaluation of novel 2-hydroxypyrrolobenzodiazepine-5,11-dione analogues as potent angiotensin converting enzyme (ACE) inhibitors. Bioorg Med Chem21:4485-93 (2013) 
 
Angiotensin-converting enzyme
Name:Angiotensin-converting enzyme
Type:n/a
Mol. Mass.:150405.15
Organism:Oryctolagus cuniculus
Description:n/a
Residue:1310
BDBM50367879
NameBDBM50367879
Synonyms:LISINOPRIL
TypeSmall organic molecule
Emp. Form.C21H31N3O5
Mol. Mass.405.4879
SMILESNCCCC[C@H](N[C@@H](CCc1ccccc1)C(O)=O)C(=O)N1CCC[C@H]1C(O)=O