Reaction Details
TargetAldo-keto reductase family 1 member C3
LigandBDBM50438582
Substrate/Competitorn/a
Meas. Tech.ChEMBL_975807 (CHEMBL2415373)
IC50 0.340000±n/a nM
Citation Watanabe, KKakefuda, AYasuda, MEnjo, KKikuchi, AFurutani, TNaritomi, YOtsuka, YOkada, MOhta, M Discovery of 2-methyl-1-{1-[(5-methyl-1H-indol-2-yl)carbonyl]piperidin-4-yl}propan-2-ol: a novel, potent and selective type 5 17ß-hydroxysteroid dehydrogenase inhibitor. Bioorg Med Chem21:5261-70 (2013) 
 
Aldo-keto reductase family 1 member C3
Name:Aldo-keto reductase family 1 member C3
Type:Enzyme
Mol. Mass.:36859.86
Organism:Homo sapiens (Human)
Description:P42330
Residue:323
BDBM50438582
NameBDBM50438582
Synonyms:CHEMBL2413849
TypeSmall organic molecule
Emp. Form.C19H26N2O2
Mol. Mass.314.4219
SMILESCc1ccc2[nH]c(cc2c1)C(=O)N1CCC(CC(C)(C)O)CC1