Reaction Details
TargetTyrosine-protein kinase JAK2
LigandBDBM50438672
Substrate/Competitorn/a
Meas. Tech.ChEMBL_976243 (CHEMBL2415128)
IC50 89±n/a nM
Citation Siu, MPastor, RLiu, WBarrett, KBerry, MBlair, WSChang, CChen, JZEigenbrot, CGhilardi, NGibbons, PHe, HHurley, CAKenny, JRCyrus Khojasteh, SLe, HLee, LLyssikatos, JPMagnuson, SPulk, RTsui, VUltsch, MXiao, YZhu, BYSampath, D 2-Amino-[1,2,4]triazolo[1,5-a]pyridines as JAK2 inhibitors. Bioorg Med Chem Lett23:5014-21 (2013) 
 
Tyrosine-protein kinase JAK2
Name:Tyrosine-protein kinase JAK2
Type:Protein
Mol. Mass.:130684.68
Organism:Homo sapiens (Human)
Description:O60674
Residue:1132
BDBM50438672
NameBDBM50438672
Synonyms:CHEMBL2414536
TypeSmall organic molecule
Emp. Form.C19H20N6O2
Mol. Mass.364.4011
SMILESCOc1ccc(cc1)-c1cccn2nc(Nc3cnn(c3)[C@H](C)CO)nc12