Reaction Details
TargetTyrosine-protein kinase JAK2
LigandBDBM50438673
Substrate/Competitorn/a
Meas. Tech.ChEMBL_976243 (CHEMBL2415128)
IC50 53±n/a nM
Citation Siu, MPastor, RLiu, WBarrett, KBerry, MBlair, WSChang, CChen, JZEigenbrot, CGhilardi, NGibbons, PHe, HHurley, CAKenny, JRCyrus Khojasteh, SLe, HLee, LLyssikatos, JPMagnuson, SPulk, RTsui, VUltsch, MXiao, YZhu, BYSampath, D 2-Amino-[1,2,4]triazolo[1,5-a]pyridines as JAK2 inhibitors. Bioorg Med Chem Lett23:5014-21 (2013) 
 
Tyrosine-protein kinase JAK2
Name:Tyrosine-protein kinase JAK2
Type:Protein
Mol. Mass.:130684.68
Organism:Homo sapiens (Human)
Description:O60674
Residue:1132
BDBM50438673
NameBDBM50438673
Synonyms:CHEMBL2414535
TypeSmall organic molecule
Emp. Form.C24H23N5O4S
Mol. Mass.477.536
SMILESCS(=O)(=O)c1ccc(cc1)-c1cccn2nc(Nc3ccc(cc3)C(=O)N3CCOCC3)nc12