Reaction Details
TargetTyrosine-protein kinase JAK2
LigandBDBM99582
Substrate/Competitorn/a
Meas. Tech.ChEMBL_976243 (CHEMBL2415128)
IC50 33±n/a nM
Citation Siu, MPastor, RLiu, WBarrett, KBerry, MBlair, WSChang, CChen, JZEigenbrot, CGhilardi, NGibbons, PHe, HHurley, CAKenny, JRCyrus Khojasteh, SLe, HLee, LLyssikatos, JPMagnuson, SPulk, RTsui, VUltsch, MXiao, YZhu, BYSampath, D 2-Amino-[1,2,4]triazolo[1,5-a]pyridines as JAK2 inhibitors. Bioorg Med Chem Lett23:5014-21 (2013) 
 
Tyrosine-protein kinase JAK2
Name:Tyrosine-protein kinase JAK2
Type:Protein
Mol. Mass.:130684.68
Organism:Homo sapiens (Human)
Description:O60674
Residue:1132
BDBM99582
NameBDBM99582
Synonyms:US8501936, 81
TypeSmall organic molecule
Emp. Form.C24H26N6O2S
Mol. Mass.462.567
SMILESCN1CCN(CC1)c1ccc(Nc2nc3cccc(-c4ccc(cc4)S(C)(=O)=O)n3n2)cc1