Reaction Details
TargetTyrosine-protein kinase JAK2
LigandBDBM50438688
Substrate/Competitorn/a
Meas. Tech.ChEMBL_976243 (CHEMBL2415128)
IC50 22±n/a nM
Citation Siu, MPastor, RLiu, WBarrett, KBerry, MBlair, WSChang, CChen, JZEigenbrot, CGhilardi, NGibbons, PHe, HHurley, CAKenny, JRCyrus Khojasteh, SLe, HLee, LLyssikatos, JPMagnuson, SPulk, RTsui, VUltsch, MXiao, YZhu, BYSampath, D 2-Amino-[1,2,4]triazolo[1,5-a]pyridines as JAK2 inhibitors. Bioorg Med Chem Lett23:5014-21 (2013) 
 
Tyrosine-protein kinase JAK2
Name:Tyrosine-protein kinase JAK2
Type:Protein
Mol. Mass.:130684.68
Organism:Homo sapiens (Human)
Description:O60674
Residue:1132
BDBM50438688
NameBDBM50438688
Synonyms:CHEMBL2414544
TypeSmall organic molecule
Emp. Form.C24H26N6O
Mol. Mass.414.5028
SMILESCOc1ccc(cc1)-c1cccc2nc(Nc3ccc(cc3)N3CCN(C)CC3)nn12