Reaction Details
TargetSubstance-P receptor
LigandBDBM50439326
Substrate/Competitorn/a
Meas. Tech.ChEMBL_977575 (CHEMBL2423357)
Ki 0.034000±n/a nM
Citation Nair, PYamamoto, TLargent-Milnes, TMCowell, SKulkarni, VMoye, SNavratilova, EDavis, PMa, SWVanderah, TWLai, JPorreca, FHruby, VJ Truncation of the peptide sequence in bifunctional ligands with mu and delta opioid receptor agonist and neurokinin 1 receptor antagonist activities. Bioorg Med Chem Lett23:4975-8 (2013) 
 
Substance-P receptor
Name:Substance-P receptor
Type:G Protein-Coupled Receptor (GPCR)
Mol. Mass.:46254.43
Organism:Homo sapiens (Human)
Description:P25103
Residue:407
BDBM50439326
NameBDBM50439326
Synonyms:CHEMBL2419537
TypeSmall organic molecule
Emp. Form.C57H67F6N9O10S
Mol. Mass.1184.252
SMILESCSCC[C@H](NC(=O)[C@H](Cc1ccccc1)NC(=O)CNC(=O)[C@@H](C)NC(=O)[C@@H](N)Cc1ccc(O)cc1)C(=O)N[C@@H](C)C(=O)N[C@@H](CC(C)C)C(=O)N[C@@H](Cc1c[nH]c2ccccc12)C(=O)OCc1cc(cc(c1)C(F)(F)F)C(F)(F)F