Reaction Details
TargetMicrotubule-associated serine/threonine-protein kinase 3
LigandBDBM50439425
Substrate/Competitorn/a
Meas. Tech.ChEMBL_980178 (CHEMBL2424216)
IC50 740±n/a nM
Citation Li, BCociorva, OMNomanbhoy, TWeissig, HLi, QNakamura, KLiyanage, MZhang, MCShih, AYAban, AHu, YCajica, JPham, LKozarich, JWShreder, KR Hit-to-lead optimization and kinase selectivity of imidazo[1,2-a]quinoxalin-4-amine derived JNK1 inhibitors. Bioorg Med Chem Lett23:5217-22 (2013) 
 
Microtubule-associated serine/threonine-protein kinase 3
Name:Microtubule-associated serine/threonine-protein kinase 3
Type:PROTEIN
Mol. Mass.:143157.77
Organism:Homo sapiens (Human)
Description:ChEMBL_107645
Residue:1309
BDBM50439425
NameBDBM50439425
Synonyms:CHEMBL2420555
TypeSmall organic molecule
Emp. Form.C26H26FN5O2
Mol. Mass.459.5153
SMILESO[C@H]1CC[C@@H](CC1)Nc1nc2ccc(cc2n2ccnc12)C(=O)NC1(CC1)c1ccc(F)cc1