Reaction Details
TargetMicrotubule-associated serine/threonine-protein kinase 3
LigandBDBM50439429
Substrate/Competitorn/a
Meas. Tech.ChEMBL_980178 (CHEMBL2424216)
IC50 1400±n/a nM
Citation Li, BCociorva, OMNomanbhoy, TWeissig, HLi, QNakamura, KLiyanage, MZhang, MCShih, AYAban, AHu, YCajica, JPham, LKozarich, JWShreder, KR Hit-to-lead optimization and kinase selectivity of imidazo[1,2-a]quinoxalin-4-amine derived JNK1 inhibitors. Bioorg Med Chem Lett23:5217-22 (2013) 
 
Microtubule-associated serine/threonine-protein kinase 3
Name:Microtubule-associated serine/threonine-protein kinase 3
Type:PROTEIN
Mol. Mass.:143157.77
Organism:Homo sapiens (Human)
Description:ChEMBL_107645
Residue:1309
BDBM50439429
NameBDBM50439429
Synonyms:CHEMBL2420562
TypeSmall organic molecule
Emp. Form.C26H29N5O2
Mol. Mass.443.5408
SMILESCC[C@@H](NC(=O)c1ccc2nc(N[C@H]3CC[C@H](O)CC3)c3nccn3c2c1)c1ccccc1