Reaction Details
TargetSerine/threonine-protein kinase mTOR
LigandBDBM50439512
Substrate/Competitorn/a
Meas. Tech.ChEMBL_979638 (CHEMBL2421130)
Ki 7.0±n/a nM
Citation Lee, WOrtwine, DFBergeron, PLau, KLin, LMalek, SNonomiya, JPei, ZRobarge, KDSchmidt, SSideris, SLyssikatos, JP A hit to lead discovery of novel N-methylated imidazolo-, pyrrolo-, and pyrazolo-pyrimidines as potent and selective mTOR inhibitors. Bioorg Med Chem Lett23:5097-104 (2013) 
 
Serine/threonine-protein kinase mTOR
Name:Serine/threonine-protein kinase mTOR
Type:Rapamycin target protein
Mol. Mass.:288917.12
Organism:Homo sapiens (Human)
Description:P42345
Residue:2549
BDBM50439512
NameBDBM50439512
Synonyms:CHEMBL2418354
TypeSmall organic molecule
Emp. Form.C23H31N7O3
Mol. Mass.453.5373
SMILESCCNC(=O)Nc1ccc(cc1)-c1nc(N2CCOC[C@@H]2C)c2nc(n(C)c2n1)C(C)(C)O