Reaction Details
TargetPhosphatidylinositol 4,5-bisphosphate 3-kinase catalytic subunit alpha isoform
LigandBDBM50439514
Substrate/Competitorn/a
Meas. Tech.ChEMBL_979637 (CHEMBL2421129)
Ki 2.0±n/a nM
Citation Lee, WOrtwine, DFBergeron, PLau, KLin, LMalek, SNonomiya, JPei, ZRobarge, KDSchmidt, SSideris, SLyssikatos, JP A hit to lead discovery of novel N-methylated imidazolo-, pyrrolo-, and pyrazolo-pyrimidines as potent and selective mTOR inhibitors. Bioorg Med Chem Lett23:5097-104 (2013) 
 
Phosphatidylinositol 4,5-bisphosphate 3-kinase catalytic subunit alpha isoform
Name:Phosphatidylinositol 4,5-bisphosphate 3-kinase catalytic subunit alpha isoform
Type:Enzyme Subunit
Mol. Mass.:124294.87
Organism:Homo sapiens (Human)
Description:P42336
Residue:1068
BDBM50439514
NameBDBM50439514
Synonyms:CHEMBL2418352
TypeSmall organic molecule
Emp. Form.C18H24N8O3
Mol. Mass.400.435
SMILESCC(C)(O)c1nc2c(nc(nc2n1CCO)-c1cnc(N)nc1)N1CCOCC1