Reaction Details
TargetSerine/threonine-protein kinase mTOR
LigandBDBM50439516
Substrate/Competitorn/a
Meas. Tech.ChEMBL_979638 (CHEMBL2421130)
Ki 2.0±n/a nM
Citation Lee, WOrtwine, DFBergeron, PLau, KLin, LMalek, SNonomiya, JPei, ZRobarge, KDSchmidt, SSideris, SLyssikatos, JP A hit to lead discovery of novel N-methylated imidazolo-, pyrrolo-, and pyrazolo-pyrimidines as potent and selective mTOR inhibitors. Bioorg Med Chem Lett23:5097-104 (2013) 
 
Serine/threonine-protein kinase mTOR
Name:Serine/threonine-protein kinase mTOR
Type:Rapamycin target protein
Mol. Mass.:288917.12
Organism:Homo sapiens (Human)
Description:P42345
Residue:2549
BDBM50439516
NameBDBM50439516
Synonyms:CHEMBL2418350
TypeSmall organic molecule
Emp. Form.C22H29N7O2
Mol. Mass.423.5114
SMILESCCNC(=O)Nc1ccc(cc1)-c1nc(N2CCOC[C@@H]2CC)c2n(C)nc(C)c2n1