Reaction Details
TargetEndoplasmin
LigandBDBM50368125
Substrate/Competitorn/a
Meas. Tech.ChEMBL_977709 (CHEMBL2424066)
IC50 11447±n/a nM
Citation Taldone, TPatel, PDPatel, MPatel, HJEvans, CERodina, AOchiana, SShah, SKUddin, MGewirth, DChiosis, G Experimental and structural testing module to analyze paralogue-specificity and affinity in the Hsp90 inhibitors series. J Med Chem56:6803-18 (2013) 
 
Endoplasmin
Name:Endoplasmin
Type:PROTEIN
Mol. Mass.:92464.42
Organism:Canis familiaris
Description:ChEMBL_1478277
Residue:804
BDBM50368125
NameBDBM50368125
Synonyms:ADENOSINE DIPHOSPHATE | ADP
TypeSmall organic molecule
Emp. Form.C10H15N5O10P2
Mol. Mass.427.2011
SMILESNc1ncnc2n(cnc12)[C@@H]1O[C@H](CO[P@@](O)(=O)OP(O)(O)=O)[C@@H](O)[C@H]1O