Reaction Details
TargetEndoplasmin
LigandBDBM50180302
Substrate/Competitorn/a
Meas. Tech.ChEMBL_977709 (CHEMBL2424066)
IC50 30±n/a nM
Citation Taldone, TPatel, PDPatel, MPatel, HJEvans, CERodina, AOchiana, SShah, SKUddin, MGewirth, DChiosis, G Experimental and structural testing module to analyze paralogue-specificity and affinity in the Hsp90 inhibitors series. J Med Chem56:6803-18 (2013) 
 
Endoplasmin
Name:Endoplasmin
Type:PROTEIN
Mol. Mass.:92464.42
Organism:Canis familiaris
Description:ChEMBL_1478277
Residue:804
BDBM50180302
NameBDBM50180302
Synonyms:8-(6-iodo-benzo[1,3]dioxol-5-ylsulfanyl)-9-(3-isopropylamino-propyl)adenine 8-[(6-IODO-1,3-BENZODIOXOL-5-YL)THIO]-9-[3-(ISOPROPYLAMINO)PROPYL]-9H-PURIN-6-AMINE US10336757, Compound PU-H71 | US10676476, Example 9
TypeSmall organic molecule
Emp. Form.C18H21IN6O2S
Mol. Mass.512.368
SMILESCC(C)NCCCn1c(Sc2cc3OCOc3cc2I)nc2c(N)ncnc12