Reaction Details
TargetEndoplasmin
LigandBDBM20732
Substrate/Competitorn/a
Meas. Tech.ChEMBL_977709 (CHEMBL2424066)
IC50 10.0±n/a nM
Citation Taldone, TPatel, PDPatel, MPatel, HJEvans, CERodina, AOchiana, SShah, SKUddin, MGewirth, DChiosis, G Experimental and structural testing module to analyze paralogue-specificity and affinity in the Hsp90 inhibitors series. J Med Chem56:6803-18 (2013) 
 
Endoplasmin
Name:Endoplasmin
Type:PROTEIN
Mol. Mass.:92464.42
Organism:Canis familiaris
Description:ChEMBL_1478277
Residue:804
BDBM20732
NameBDBM20732
Synonyms:(4E,6Z,8S,9S,10E,12S,13R,14S,16R)-13-hydroxy-8,14,19-trimethoxy-4,10,12,16-tetramethyl-3,20,22-trioxo-2-azabicyclo[16.3.1]docosa-1(21),4,6,10,18-pentaen-9-yl carbamate CHEMBL278315 Geldanamycin | geldanomycin
Typen/a
Emp. Form.C29H40N2O9
Mol. Mass.560.6359
SMILESCO[C@H]1CC(C)=Cc2c(O)c(NC(=O)C(C)=CC=C[C@H](OC)[C@@H](OC(N)=O)\C(C)=C\[C@H](C)[C@H]1O)cc(O)c2OC