Reaction Details
TargetEndoplasmin
LigandBDBM50439623
Substrate/Competitorn/a
Meas. Tech.ChEMBL_977713 (CHEMBL2424070)
Kd 6.6±n/a nM
Citation Taldone, TPatel, PDPatel, MPatel, HJEvans, CERodina, AOchiana, SShah, SKUddin, MGewirth, DChiosis, G Experimental and structural testing module to analyze paralogue-specificity and affinity in the Hsp90 inhibitors series. J Med Chem56:6803-18 (2013) 
 
Endoplasmin
Name:Endoplasmin
Type:PROTEIN
Mol. Mass.:92464.42
Organism:Canis familiaris
Description:ChEMBL_1478277
Residue:804
BDBM50439623
NameBDBM50439623
Synonyms:CHEMBL2419342
TypeSmall organic molecule
Emp. Form.C36H26IN7O7S2
Mol. Mass.859.669
SMILESNc1ncnc2n(CCCNC(=S)Nc3ccc(c(c3)C(O)=O)-c3c4ccc(O)cc4oc4cc(=O)ccc34)c(Sc3cc4OCOc4cc3I)nc12