Reaction Details
TargetOrexin receptor type 2
LigandBDBM50440021
Substrate/Competitorn/a
Meas. Tech.ChEMBL_982717 (CHEMBL2428737)
Ki 1.000000±n/a nM
Citation Oi, NSuzuki, MTerauchi, TTokunaga, MNakatani, YYamamoto, NFukumura, TZhang, MRSuhara, THiguchi, M Synthesis and evaluation of novel radioligands for positron emission tomography imaging of the orexin-2 receptor. J Med Chem56:6371-85 (2013) 
 
Orexin receptor type 2
Name:Orexin receptor type 2
Type:Protein
Mol. Mass.:50710.53
Organism:Homo sapiens (Human)
Description:O43614
Residue:444
BDBM50440021
NameBDBM50440021
Synonyms:CHEMBL2425788
TypeSmall organic molecule
Emp. Form.C23H23FN4O3
Mol. Mass.422.4521
SMILESCOCc1nc(C)ncc1OC[C@]1(C[C@H]1C(=O)Nc1ccc(F)cn1)c1ccccc1