Reaction Details
TargetGlutamate receptor ionotropic, NMDA 2C
LigandBDBM50440089
Substrate/Competitorn/a
Meas. Tech.ChEMBL_983748 (CHEMBL2427901)
IC50 5000±n/a nM
Citation Acker, TMKhatri, AVance, KMSlabber, CBacsa, JSnyder, JPTraynelis, SFLiotta, DC Structure-activity relationships and pharmacophore model of a noncompetitive pyrazoline containing class of GluN2C/GluN2D selective antagonists. J Med Chem56:6434-56 (2013) 
 
Glutamate receptor ionotropic, NMDA 2C
Name:Glutamate receptor ionotropic, NMDA 2C
Type:Protein
Mol. Mass.:135305.94
Organism:Rattus norvegicus (Rat)
Description:Q00961
Residue:1237
BDBM50440089
NameBDBM50440089
Synonyms:CHEMBL2426089
TypeSmall organic molecule
Emp. Form.C29H21ClF3N3O4
Mol. Mass.567.943
SMILESOC(=O)CCC(=O)N1N=C(CC1c1ccc(cc1)C(F)(F)F)c1c(-c2ccccc2)c2cc(Cl)ccc2[nH]c1=O