Reaction Details
TargetLysine-specific demethylase 5A
LigandBDBM50440288
Substrate/Competitorn/a
Meas. Tech.ChEMBL_982482 (CHEMBL2427608)
IC50 35000±n/a nM
Citation Suzuki, TOzasa, HItoh, YZhan, PSawada, HMino, KWalport, LOhkubo, RKawamura, AYonezawa, MTsukada, YTumber, ANakagawa, HHasegawa, MSasaki, RMizukami, TSchofield, CJMiyata, N Identification of the KDM2/7 histone lysine demethylase subfamily inhibitor and its antiproliferative activity. J Med Chem56:7222-31 (2013) 
 
Lysine-specific demethylase 5A
Name:Lysine-specific demethylase 5A
Type:Protein
Mol. Mass.:192091.79
Organism:Homo sapiens (Human)
Description:P29375
Residue:1690
BDBM50440288
NameBDBM50440288
Synonyms:CHEMBL2424813
TypeSmall organic molecule
Emp. Form.C17H31NO4
Mol. Mass.313.4323
SMILESON(CCC(O)=O)C(=O)CCCCCCCCC1CCCC1