Reaction Details
TargetLysine-specific demethylase 4A
LigandBDBM26106
Substrate/Competitorn/a
Meas. Tech.ChEMBL_982483 (CHEMBL2427609)
IC50 250000±n/a nM
Citation Suzuki, TOzasa, HItoh, YZhan, PSawada, HMino, KWalport, LOhkubo, RKawamura, AYonezawa, MTsukada, YTumber, ANakagawa, HHasegawa, MSasaki, RMizukami, TSchofield, CJMiyata, N Identification of the KDM2/7 histone lysine demethylase subfamily inhibitor and its antiproliferative activity. J Med Chem56:7222-31 (2013) 
 
Lysine-specific demethylase 4A
Name:Lysine-specific demethylase 4A
Type:Enzyme
Mol. Mass.:120647.83
Organism:Homo sapiens (Human)
Description:O75164
Residue:1064
BDBM26106
NameBDBM26106
Synonyms:CHEMBL90852 NOG [(carboxymethyl)carbamoyl]formic acid
TypeSmall organic molecule
Emp. Form.C4H5NO5
Mol. Mass.147.0862
SMILESOC(=O)CNC(=O)C(O)=O