Reaction Details
TargetTransient receptor potential cation channel subfamily V member 1
LigandBDBM50440399
Substrate/Competitorn/a
Meas. Tech.ChEMBL_982063 (CHEMBL2428538)
EC50 3.2±n/a nM
Citation Lim, KSLee, HKim, SEHa, THAnn, JSon, KChoi, SSun, WPearce, LVDeAndrea-Lazarus, IABlumberg, PMLee, J The carbonate analogues of 5'-halogenated resiniferatoxin as TRPV1 ligands. Eur J Med Chem68:233-43 (2013) 
 
Transient receptor potential cation channel subfamily V member 1
Name:Transient receptor potential cation channel subfamily V member 1
Type:Transient Receptor
Mol. Mass.:94956.12
Organism:Rattus norvegicus (rat)
Description:O35433
Residue:838
BDBM50440399
NameBDBM50440399
Synonyms:CHEMBL2425544
TypeSmall organic molecule
Emp. Form.C36H38FNO9
Mol. Mass.647.6866
SMILESCOc1cc(OC(=O)OCC2=C[C@H]3[C@H]4O[C@]5(Cc6ccccc6)O[C@]4(C[C@@H](C)[C@]3(O5)[C@@H]3C=C(C)C(=O)[C@@]3(O)C2)C(C)=C)cc(F)c1N