Reaction Details
TargetTransient receptor potential cation channel subfamily V member 1
LigandBDBM50440401
Substrate/Competitorn/a
Meas. Tech.ChEMBL_982064 (CHEMBL2428539)
Ki 0.58±n/a nM
Citation Lim, KSLee, HKim, SEHa, THAnn, JSon, KChoi, SSun, WPearce, LVDeAndrea-Lazarus, IABlumberg, PMLee, J The carbonate analogues of 5'-halogenated resiniferatoxin as TRPV1 ligands. Eur J Med Chem68:233-43 (2013) 
 
Transient receptor potential cation channel subfamily V member 1
Name:Transient receptor potential cation channel subfamily V member 1
Type:Transient Receptor
Mol. Mass.:94956.12
Organism:Rattus norvegicus (rat)
Description:O35433
Residue:838
BDBM50440401
NameBDBM50440401
Synonyms:CHEMBL2425550
TypeSmall organic molecule
Emp. Form.C36H39NO9
Mol. Mass.629.6962
SMILESCOc1cc(OC(=O)OCC2=C[C@H]3[C@H]4O[C@]5(Cc6ccccc6)O[C@]4(C[C@@H](C)[C@]3(O5)[C@@H]3C=C(C)C(=O)[C@@]3(O)C2)C(C)=C)ccc1N