Reaction Details
TargetTransient receptor potential cation channel subfamily V member 1
LigandBDBM50305285
Substrate/Competitorn/a
Meas. Tech.ChEMBL_982061 (CHEMBL2428536)
Ki 2.2±n/a nM
Citation Lim, KSLee, HKim, SEHa, THAnn, JSon, KChoi, SSun, WPearce, LVDeAndrea-Lazarus, IABlumberg, PMLee, J The carbonate analogues of 5'-halogenated resiniferatoxin as TRPV1 ligands. Eur J Med Chem68:233-43 (2013) 
 
Transient receptor potential cation channel subfamily V member 1
Name:Transient receptor potential cation channel subfamily V member 1
Type:Transient Receptor
Mol. Mass.:94956.12
Organism:Rattus norvegicus (rat)
Description:O35433
Residue:838
BDBM50305285
NameBDBM50305285
Synonyms:CHEMBL595262 | [(1R,2R,6R,10S,11R,13S,15R,17R)-13-benzyl-6-hydroxy-4,17-dimethyl-5-oxo-15-(prop-1-en-2-yl)-12,14,18-trioxapentacyclo[11.4.1.0^{1,10}.0^{2,6}.0^{11,15}]octadeca-3,8-dien-8-yl]methyl (4-hydroxy-3-iodo-5-methoxyphenyl) carbonate
TypeSmall organic molecule
Emp. Form.C36H37IO10
Mol. Mass.756.5775
SMILESCOc1cc(OC(=O)OCC2=C[C@H]3[C@H]4O[C@]5(Cc6ccccc6)O[C@]4(C[C@@H](C)[C@]3(O5)[C@@H]3C=C(C)C(=O)[C@@]3(O)C2)C(C)=C)cc(I)c1O