Reaction Details
TargetTransient receptor potential cation channel subfamily V member 1
LigandBDBM50440398
Substrate/Competitorn/a
Meas. Tech.ChEMBL_982061 (CHEMBL2428536)
Ki 21±n/a nM
Citation Lim, KSLee, HKim, SEHa, THAnn, JSon, KChoi, SSun, WPearce, LVDeAndrea-Lazarus, IABlumberg, PMLee, J The carbonate analogues of 5'-halogenated resiniferatoxin as TRPV1 ligands. Eur J Med Chem68:233-43 (2013) 
 
Transient receptor potential cation channel subfamily V member 1
Name:Transient receptor potential cation channel subfamily V member 1
Type:Transient Receptor
Mol. Mass.:94956.12
Organism:Rattus norvegicus (rat)
Description:O35433
Residue:838
BDBM50440398
NameBDBM50440398
Synonyms:CHEMBL2425548
TypeSmall organic molecule
Emp. Form.C36H37ClO10
Mol. Mass.665.126
SMILESCOc1cc(OC(=O)OCC2=C[C@H]3[C@H]4O[C@]5(Cc6ccccc6)O[C@]4(C[C@@H](C)[C@]3(O5)[C@@H]3C=C(C)C(=O)[C@@]3(O)C2)C(C)=C)cc(Cl)c1O