Reaction Details
TargetTransient receptor potential cation channel subfamily V member 1
LigandBDBM50440395
Substrate/Competitorn/a
Meas. Tech.ChEMBL_982059 (CHEMBL2428534)
Ki 212±n/a nM
Citation Lim, KSLee, HKim, SEHa, THAnn, JSon, KChoi, SSun, WPearce, LVDeAndrea-Lazarus, IABlumberg, PMLee, J The carbonate analogues of 5'-halogenated resiniferatoxin as TRPV1 ligands. Eur J Med Chem68:233-43 (2013) 
 
Transient receptor potential cation channel subfamily V member 1
Name:Transient receptor potential cation channel subfamily V member 1
Type:Protein
Mol. Mass.:94960.75
Organism:Homo sapiens (Human)
Description:Q8NER1
Residue:839
BDBM50440395
NameBDBM50440395
Synonyms:CHEMBL2425546
TypeSmall organic molecule
Emp. Form.C36H38BrNO9
Mol. Mass.708.592
SMILESCOc1cc(OC(=O)OCC2=C[C@H]3[C@H]4O[C@]5(Cc6ccccc6)O[C@]4(C[C@@H](C)[C@]3(O5)[C@@H]3C=C(C)C(=O)[C@@]3(O)C2)C(C)=C)cc(Br)c1N