Reaction Details
TargetReceptor-type tyrosine-protein phosphatase C
LigandBDBM53072
Substrate/Competitorn/a
Meas. Tech.ChEMBL_984732 (CHEMBL2432106)
IC50 41400±n/a nM
Citation Liu, WYu, BXu, GXu, WRLoh, MLTang, LDQu, CK Identification of cryptotanshinone as an inhibitor of oncogenic protein tyrosine phosphatase SHP2 (PTPN11). J Med Chem56:7212-21 (2013) 
 
Receptor-type tyrosine-protein phosphatase C
Name:Receptor-type tyrosine-protein phosphatase C
Type:Protein
Mol. Mass.:147474.19
Organism:Homo sapiens (Human)
Description:P08575
Residue:1306
BDBM53072
NameBDBM53072
Synonyms:(5Z)-3-allyl-5-(3-ethyl-1,3-benzothiazol-2-ylidene)-2-thioxo-thiazolidin-4-one (5Z)-5-(3-ethyl-1,3-benzothiazol-2-ylidene)-3-prop-2-enyl-2-sulfanylidene-4-thiazolidinone MLS001210616 cid_3094418
TypeSmall organic molecule
Emp. Form.C15H14N2OS3
Mol. Mass.334.479
SMILESCCN1\C(Sc2ccccc12)=C1\SC(=S)N(CC=C)C1=O